{"text_format":"1","workbook":"xlsx","n_sheets":11,"sheets":["Readme","DATA SHEET","TRA_Window","Window_Calcs","Profile","Profile_Calcs","Calcs","Tables","STATUS","Export General Data","Export Loads Data"],"not_rendered":{"charts":2,"images":0,"macros":1,"external_links":0,"defined_names":92,"comments":2,"pivot_tables":0},"unopened":[],"bounds":{"document_bytes":16777216,"sheet_cells":100000,"rows_first":2000,"rows_last":500,"rows_between":2000,"halvings":0,"cell_chars":16384,"cell_head_chars":4096},"cells_cut":0,"cells_raw":0,"read":"whole","date_system":"1900"}

{"sheet":"Readme","index":0,"n_rows":67,"n_cols":2,"rows_kept":67,"cut":false,"hidden":false,"merged":[[24,1,24,9],[28,1,28,9],[26,1,26,9]]}
[null,"THE TIRE AND RIM ASSOCIATION, INC."]
[null,"HIGH FLOTATION RADIAL LIGHT TRUCK TIRE PROFILE PROGRAM "]
[]
[null,"IMPORTANT\nThe TRA High Flotation Radial Light Truck tire profile program was created to provide a convenient, electronic presentation of data resulting from applying formulae and guidelines for light truck tires shown in the TRA Engineering Design Information and the Year Book. All information provided in this program is advisory only and only tire sizes and load versions published in the TRA Year Book and Engineering Design Information are standardized by the Association. Any new tire sizes, load versions or other information must be approved be the approriate committees and published by TRA before they can be considered standardized.   This program only applies to light truck high flotation radial tires."]
[]
[null,"Because the program is still a work in progress, we would appreciate any feedback you can provide regarding errors, ommisions, problems or other suggestions to make it more usable and accurate. Please contact:"]
[]
[null," The Tire and Rim Association"]
[null," 4000 Embassy Parkway, Suite 390"]
[null," Akron, Ohio 44333"]
[null," ph - 330-666-8121"]
[null," email - rudyc@us-tra.org"]
[]
[null,"INSTRUCTIONS: "]
[null,"Enter data in the \"TRA Data\" worksheet as follows:"]
{"$rows_left_out":53}
{"sheet":"DATA SHEET","index":1,"n_rows":32,"n_cols":34,"rows_kept":32,"cut":false,"hidden":false,"merged":[[15,8,15,33],[11,14,12,33],[13,14,13,33],[29,2,29,16],[16,31,16,33],[17,31,17,33],[18,33,19,33],[25,24,25,25],[26,24,26,25],[24,22,24,23],[25,14,25,16],[25,22,25,23],[23,17,23,18],[22,24,24,25],[22,17,22,23],[23,19,23,23],[24,19,24,21],[24,17,24,18],[25,5,26,5],[25,6,26,6],[25,10,25,11],[25,12,25,13],[24,14,24,16],[25,7,26,7],[25,8,26,9],[26,10,26,11],[26,12,26,13],[24,8,24,9],[24,10,24,11],[24,12,24,13],[22,2,24,7],[22,8,22,9],[23,8,23,9],[18,2,19,2],[18,3,19,3],[25,2,26,2],[25,3,26,3],[25,4,26,4],[9,2,9,30],[8,2,8,30],[11,10,11,13],[12,10,12,13],[13,10,13,13],[16,13,16,15],[26,22,26,23],[25,19,25,21],[26,19,26,21],[21,8,21,30],[18,30,19,30],[17,28,17,30],[16,28,16,30],[23,10,23,11],[23,12,23,16],[22,26,24,30],[26,14,26,16],[25,26,26,30],[26,17,26,18],[25,17,25,18],[22,10,22,16],[1,2,1,30],[2,2,2,30],[3,2,3,30],[5,11,5,15],[5,22,5,25],[16,18,16,20],[16,23,16,25],[17,18,17,20],[17,23,17,25],[18,4,19,4],[18,5,19,5],[18,6,19,6],[18,7,19,7],[18,11,19,11],[18,15,19,15],[18,20,19,20],[18,25,19,25],[15,2,17,7],[16,9,16,11],[17,9,17,11],[17,13,17,15],[30,2,31,8],[30,9,31,9],[30,10,30,11],[31,10,31,11],[30,14,30,15],[31,14,31,15]]}
[]
[null,null,"This Version includes the Load Index cap of 128 which is effective January 1, 2009; contact TRA office for original calculations. Certain sizes with 17 rim diameter code designed from July 28, 1998 to October 23, 2020 were standardized with a Load Index cap of 121; contact TRA office for original calculations. Loads for the 33x9.50R15LT LR C, 33x12.50R22LT LR F, 35x13.50R24LT LR E, 37x14.50R24LT LR F, and 42x15.50R28LT LR E differ from the standard calculations; see current TRA Year Book for standardized loads."]
[null,null,"THE TIRE AND RIM ASSOCIATION, INC."]
[null,null,"LT_HIFLO_PROFILE PROGRAM"]
[]
[null,null,33,"x",11.5,{"$f":"IF(S14=\"RADIAL PLY\",\"R\",\"-\")","v":"R"},22,"LT","LR","F","←","TYPE IN SIZE DESIGNATION",null,null,null,null,null,null,null,null,null,null,"For TRA internal use only:",null,null,null,"Load DB"]
[]
[]
[null,null,"TRA DATA SHEET"]
[null,null,"LIGHT TRUCK HIGH FLOTATION RADIAL PLY TIRES MOUNTED ON 5 DEGREE DROP CENTER RIMS"]
[]
[null,null,null,null,null,null,null,null,null,"TRA STATUS =",{"$f":"STATUS!C3","v":"Not Standardized"},null,null,null,{"$f":"IF(Incorrect_Profile,\"Aspect ratio out of 30-70 range - Revise either tire OD, Section Width and / or Rim Diameter or contact TRA !\",IF(Out_of_LI_Range,\"Size out of LI range\",IF(AND(OR(K12=\"TRA Standard\",K12=\"Design Guide\"),STATUS!B4=\"yes\"),\"\",IF(AND(OR(K12=\"TRA Standard\",K12=\"Design Guide\"),STATUS!B4=\"no\"),\"Load Range must be confirmed by TRA\",\"Tire Size and Load Range must be confirmed by TRA\"))))","v":"Tire Size and Load Range must be confirmed by TRA"}]
[null,null,null,null,null,null,null,null,null,"APPROVED  LOAD RANGE(S) =",{"$f":"STATUS!B3","v":"N/A"}]
[null,null,null,null,null,null,null,null,null,"LOCATION =",{"$f":"STATUS!D3","v":"N/A"},null,null,null,{"$f":"IF(AND(AA26<>\"N/A\",COUNTIF(J19:AB20,\"*n/a*\")<>0),\"Missing loads, LR and LIs at lower pressures are out of current scope\",\" \")","v":"Missing loads, LR and LIs at lower pressures are out of current scope"}]
[]
{"$rows_left_out":18}
{"sheet":"TRA_Window","index":2,"n_rows":33,"n_cols":11,"rows_kept":33,"cut":false,"hidden":false,"merged":[[32,5,32,6],[29,7,29,9],[30,7,30,9],[31,7,31,9],[32,7,32,9],[3,1,5,1],[28,5,28,6],[29,5,29,6],[30,5,30,6],[31,5,31,6],[5,6,5,7]]}
[]
[]
[]
[null,"TRA",null,null,null,"Tread Depth Options: ","HWY / TRAC. Tread"]
[]
[null,null,"Rim Width Options: ","Meas.",null,"Approved Rim Contours: ",{"$f":"'DATA SHEET'!AA26","v":"8J, 8½J, 9J, 9½J, 10J, 10½J"}]
[]
[]
[]
[]
[]
[]
[]
[]
[]
{"$rows_left_out":19}
{"sheet":"Window_Calcs","index":3,"n_rows":58,"n_cols":9,"rows_kept":58,"cut":false,"hidden":true,"merged":[]}
["TRA"]
[null,{"$f":"\"TRA Window - \"&Dimen&\"  (\"&Rim&\")\"&IF(Flag1=TRUE,\" - HWY/Traction Tread - Radial Ply\",\" - DEEP Traction Tread - Radial Ply\")","v":"TRA Window - 33x11.50R22 LT  (22x9J) - HWY/Traction Tread - Radial Ply"}]
[]
[]
[null,"Design"]
[null,null,"SW","OD"]
[]
[null,"@ Min1 SW",{"$f":"MIN_SW1","v":276},{"$f":"MIN_OD1","v":826}]
[null,"@ Min2 SW",{"$f":"MIN_SW2","v":283},{"$f":"MIN_OD2","v":819}]
[null,"@ Max SW",{"$f":"ROUND('DATA SHEET'!K26*VLOOKUP(\"TRA Max\",Profile_Tbl,2)+(New_Rim_Width-M_Rim)*10,0)","v":310},{"$f":"MIN_OD2","v":819}]
[null,"@ Max SW",{"$f":"C10","v":310},{"$f":"ROUND(2*IF(Flag1=TRUE,ROUND(Calcs!I7*25.4*1.03,0),ROUND(Calcs!I7*25.4*1.03,0)+3)+Dr_mm,0)","v":835}]
[null,"@ Max OD",{"$f":"C10","v":310},{"$f":"D11","v":835}]
[null,"@ Max OD",{"$f":"MIN_SW1","v":276},{"$f":"D11","v":835}]
[null,"@ Min1 SW",{"$f":"MIN_SW1","v":276},{"$f":"MIN_OD1","v":826}]
[]
{"$rows_left_out":44}
{"sheet":"Profile","index":4,"n_rows":52,"n_cols":10,"rows_kept":52,"cut":false,"hidden":false,"merged":[[6,8,6,9],[5,6,5,8],[49,5,49,6],[50,5,50,6],[51,5,51,6],[45,5,45,6],[46,5,46,6],[47,5,47,6],[48,5,48,6],[1,1,5,1],[5,4,5,5],[44,5,44,6],[34,3,35,3],[34,4,36,4],[37,5,37,6],[38,5,38,6],[39,5,39,6],[40,5,40,6],[41,5,41,6],[42,5,42,6],[43,5,43,6]]}
[null,null,null,null,null,null,null,null,null,{"$f":"Prof_Type","v":"TRA Design"}]
[null,"TRA","Tire Profile Sizing Options: ","TRA Design",null,"Tread Depth Options: ","HWY / TRAC. Tread"]
[]
[]
[]
[null,null,"Rim Width Options: ","Meas.","Approved Rim Contours: ",null,{"$f":"'DATA SHEET'!AA26","v":"8J, 8½J, 9J, 9½J, 10J, 10½J"}]
[null,null,null,null,null,null,null,null,"Enter Custom Values"]
[null,null,null,null,null,null,null,null,300,"SW (on Meas. Rim)"]
[null,null,null,null,null,null,null,null,925,"OD"]
[null,null,null,null,null,null,null,null,30,"Shoulder Radius"]
[null,null,null,null,null,null,null,null,1300,"Tread Arc Rad (R)"]
[null,null,null,null,null,null,null,null,250,"Tread Arc Width (C)"]
[]
[]
[]
{"$rows_left_out":38}
{"sheet":"Profile_Calcs","index":5,"n_rows":539,"n_cols":22,"rows_kept":539,"cut":false,"hidden":true,"merged":[]}
["TRA"]
[null,"ENVELOPE CALCULATIONS",null,null,null,null,null,null,"Real X","Tire profile","Rim Profile","Max profile","Table Data 1","Table Data 2","Table Data 3","Table Data 4","No arrow lines","Double arrow lines","Single arrow lines","Label lines","Real Y"]
[null,null,null,null,null,null,null,"TIRE PROFILE: TIRE CROWN"]
[null,null,"New",null,null,null,null,"Right side"]
[null,"TIRE SIZE",{"$f":"Dimen","v":"33x11.50R22 LT"},null,null,null,null,{"$f":"ACOS($I$5/(Tread_Rad))","v":1.5142602519988986},{"$f":"P1_X","v":110.13011923276309},{"$f":"U5+Center","v":235.98600818181978},null,null,null,null,null,null,null,null,null,null,{"$f":"P1_Y","v":409.88600818181976}]
[null,"RIM FLANGE TYPE","J","<--- Fixed",null,null,null,{"$f":"(H$15-H$5)/10+H5","v":1.5199138594784984},{"$f":"COS(H6)*Tread_Rad","v":99.127142093407201},236.57753896632278,null,null,null,null,null,null,null,null,null,null,{"$f":"SIN(H6)*Tread_Rad+OD/2-Tread_Rad","v":410.47753896632275}]
[null,null,null,null,null,null,null,1.5255674669580983,{"$f":"COS(H7)*Tread_Rad","v":88.120996534136907},237.1068541147539,null,null,null,null,null,null,null,null,null,null,411.00685411475388]
[null,"RIM WIDTH  (IN)",{"$f":"IF(O_Rim=0,M_Rim,O_Rim)","v":9},null,null,null,null,1.5312210744376982,77.11203434650028,237.57393670851036,null,null,null,null,null,null,null,null,null,null,411.47393670851034]
[null,null,null,null,null,null,null,1.536874681917298,66.100607412073785,237.97877181814249,null,null,null,null,null,null,null,null,null,null,411.87877181814247]
[null,"RTW",{"$f":"IF(Prof_Type=\"Custom\",Cust_C,ROUND(INDEX(RTW_Tbl_X,MATCH(A&\" - \"&Prof_Type,RTW_Tbl_AR,0))*'DATA SHEET'!K26,0))","v":238},null,null,null,null,1.5425282893968979,55.08706769121509,238.3213465038267,null,null,null,null,null,null,null,null,null,null,412.22134650382668]
[null,"SECTION WIDTH",{"$f":"DSW","v":290},null,null,null,null,1.5481818968764978,44.071767211813267,238.60164981578293,null,null,null,null,null,null,null,null,null,null,412.50164981578291]
[null,"SECTION HEIGHT",{"$f":"SH","v":133.60400000000004},null,null,null,null,1.5538355043560976,33.055058058036821,238.81967279462208,null,null,null,null,null,null,null,null,null,null,412.71967279462206]
[null,"OVERALL DIAM.  (mm)",{"$f":"OD","v":826},null,null,null,null,1.5594891118356975,22.037292359080006,238.97540847163475,null,null,null,null,null,null,null,null,null,null,412.87540847163473]
[null,"TREAD RADIUS  (mm)",{"$f":"ROUND(INDEX(RTW_Tbl_Trd_Rad__Y,MATCH(A&\" - \"&Prof_Type,RTW_Tbl_AR,0))*DSW_M,0)","v":1949},null,null,null,null,1.5651427193152974,11.018822277907637,239.06885186901002,null,null,null,null,null,null,null,null,null,null,412.96885186901]
[null,"SHOULDER RADIUS (mm)",{"$f":"VLOOKUP(Prof_Type,Profile_Tbl,4)","v":20},null,null,null,null,{"$f":"PI()/2","v":1.5707963267948966},0,239.10000000000002,null,null,null,null,null,null,null,null,null,null,413]
{"$rows_left_out":525}
{"sheet":"Calcs","index":6,"n_rows":46,"n_cols":14,"rows_kept":46,"cut":false,"hidden":true,"merged":[]}
["TRA"]
[]
[null,"Independent Variables"]
[]
[null,"Prof_Type",{"$f":"Profile!D2","v":"TRA Design"}]
[null,"Title",{"$f":"\"''\"&Prof_Type&\"'' Tire Profile\"&\" - \"&Dimen&IF(Flag1=TRUE,\" - HWY/Traction Tread - Radial Ply\",\" - DEEP Traction Tread - Radial Ply\")&\"                                                   Estimated Dimensions\"","v":"''TRA Design'' Tire Profile - 33x11.50R22 LT - HWY/Traction Tread - Radial Ply                                                   Estimated Dimensions"},null,"Dr","RIM","SW","Do","H","S.70","S.80","D","AR","Sd"]
[null,"Rim",{"$f":"FIXED(Dr,0)&\"x\"&IF(Contour=\"Meas.\",M_Contour,Contour)","v":"22x9J"},null,{"$f":"Rim_Code","v":22},{"$f":"IF(AR>0.45,VLOOKUP(SN,Tables!$AG$6:$AI$18,2),IF(AR>0.4,VLOOKUP(SN,Tables!$AG$23:$AI$35,2),VLOOKUP(SN,Tables!$AG$39:$AI$51,2)))","v":9},{"$f":"'DATA SHEET'!$K$27","v":11.42},{"$f":"Do_nom-0.48","v":32.520000000000003},{"$f":"(Do-Dr)/2","v":5.2600000000000016},{"$f":"ROUND(+G7*((180-((180*ASIN(F7/G7))/PI()))/135.6),2)","v":10.78},{"$f":"ROUND(+G7*((180-((180*ASIN(F7/G7))/PI()))/126.9),2)","v":11.52},{"$f":"(0.96*J7)-I7","v":5.0887999999999973},{"$f":"((Do-Dr)/2)/SN","v":0.45739130434782621},{"$f":"IF(L7<=0,K7,(K7-(0.7252-0.1297*(L7/K7)+1.0469*((L7/K7)^2))*L7))","v":7.0816033324547139}]
[]
[null,"PROFILE CENTER:",{"$f":"-Rim_Code*12.7+VLOOKUP(MAX_SW,Scale_Tbl2,4)-MAX_SH/2","v":-173.89999999999998}]
[null,"X Ratio:",{"$f":"(VLOOKUP(MAX_SW,Scale_Tbl2,2)+20)/150","v":1.3}]
[null,"Y Ratio:",{"$f":"(VLOOKUP(MAX_SW,Scale_Tbl,3)+20)/200","v":1.45}]
[null,"Tread depth selection",{"$f":"TRA_Window!G4","v":"HWY / TRAC. Tread"},null,null,null,null,null,null,null,"Standardized LR",{"$f":"IF(ISNUMBER(SEARCH(\"B\",STATUS!B3)),\"B\",\"\")","v":""}]
[null,"Flag1 (Hwy/Traction Tread)",{"$f":"IF(C12=Tables!R46,TRUE,FALSE)","v":true},null,null,null,null,null,null,null,"Standardized LR",{"$f":"IF(ISNUMBER(SEARCH(\"C\",STATUS!B3)),\"C\",\"\")","v":""}]
[null,"Flag2 (Deep Traction Tread)",{"$f":"IF(C12=Tables!R47,TRUE,FALSE)","v":false},null,null,null,null,null,null,null,"Standardized LR",{"$f":"IF(ISNUMBER(SEARCH(\"D\",STATUS!B3)),\"D\",\"\")","v":""}]
[null,null,null,null,null,null,null,null,null,null,"Standardized LR",{"$f":"IF(ISNUMBER(SEARCH(\"E\",STATUS!B3)),\"E\",\"\")","v":""}]
{"$rows_left_out":32}
{"sheet":"Tables","index":7,"n_rows":178,"n_cols":46,"rows_kept":178,"cut":false,"hidden":true,"merged":[[48,14,50,14],[36,32,36,34],[19,32,19,34],[1,32,1,34],[2,32,2,34],[48,15,50,16]]}
[null,null,null,null,null,null,null,null,null,null,"TRA"]
[null,"LI","AVG","LI","Load Index","LOAD\nkg","LOAD\nlb","AVG","Index",null,"Rim Flange Values",null,null,null,null,null,null,null,null,"RIM","mm","Rim Seat",null,null,null,null,null,null,null,null,null,null,"RIM WIDTH / SECTION WIDTH",null,null,null,"FOR ASPECT RATIO ≥ 70",null,"FOR ASPECT RATIO ˂ 70, > 45",null,"FOR ASPECT RATIO ≤ 45, > 40",null,"FOR ASPECT RATIO ≤ 40, > 30",null,"FOR ASPECT RATIO ≤ 30"]
[null,null,null,null,null,null,null,null,null,null,null,null,null,null,null,null,null,null,null,0,0,0,null,null,null,null,null,null,null,null,null,null,"FOR ASPECT RATIO > 45",null,null,null,"NOMINAL","APPROVED","NOMINAL","APPROVED","NOMINAL","APPROVED","NOMINAL","APPROVED","NOMINAL","APPROVED"]
[null,null,null,null,null,null,null,null,null,null,"Rim Profile ","DX","DY","Flange Height","Flange Rad","Heel Rad","Bmax",null,null,10,254,253.2,null,null,null,null,null,null,null,null,null,null,"NOMINAL","RIM","SECTION",null,"SECT. WIDTH ","RIMS","SECT. WIDTH ","RIMS","SECT. WIDTH ","RIMS","SECT. WIDTH ","RIMS","SECT. WIDTH ","RIMS"]
[null,335,335,335,70,335,740,740,70,null,null,null,null,null,null,null,null,null,null,11,{"$f":"279","v":279},{"$f":"278.6","v":278.60000000000002},null,null,null,null,null,null,null,null,null,null,"SECT. WIDTH","WIDTH","WIDTH"]
[null,345,340,345,71,345,760,{"$f":"AVERAGEA(G5:G6)","v":750},71,null,"B",5.0139599999999991,13.61186,14.4,7.5,4.5,13,null,null,12,305,304,null,null,null,null,null,null,null,null,null,null,7.5,{"$f":"MROUND(AG6*0.8,0.5)","v":6},{"$f":"AG6+(0.4*(AH6-(AG6*0.8)))","v":7.5},null,7.5,"5J, 5½J, 6J, 6½J",7.5,"5½J, 6J, 6½J, 7J",7.5,"6J, 6½J, 7J",7.5,"6½J, 7J, 7½J",7.5,"7J, 7½J"]
[null,355,350,355,72,355,785,772.5,72,null,"J",5.8496199999999998,17.078959999999999,17.5,9.5,6.5,15,null,null,13,330,329.4,null,null,null,null,null,null,null,null,null,null,8.5,7,8.58,null,8.5,"5½J, 6J, 6½J, 7J",8.5,"6J, 6½J, 7J, 7½J",8.5,"7J, 7½J, 8J",8.5,"7J, 7½J, 8J, 8½J",8.5,"7½J, 8J, 8½J"]
[null,365,360,365,73,365,805,795,73,null,"K",7.0205599999999997,18.86458,19.600000000000001,10.7,7.1,15,null,null,14,356,354.8,null,null,null,null,null,null,null,null,null,null,9.5,7.5,9.4599999999999991,null,9.5,"6J, 6½J, 7J, 7½J, 8J",9.5,"6½J, 7J, 7½J, 8J, 8½J",9.5,"7½J, 8J, 8½J, 9J",9.5,"8J, 8½J, 9J, 9½J",9.5,"8½J, 9J, 9½J"]
[null,375,370,375,74,375,825,815,74,null,"L",6.6547999999999998,20.764500000000002,21.6,11.9,7.1,15,null,null,15,381,380.2,null,null,null,null,null,null,null,null,null,null,10.5,8.5,10.54,null,10.5,"7J, 7½J, 8J, 8½J, 9J",10.5,"7½J, 8J, 8½J, 9J, 9½J",10.5,"8½J, 9J, 9½J, 10J",10.5,"9J, 9½J, 10J, 10½J",10.5,"9½J, 10J, 10½J"]
[null,387,381,387,75,387,855,840,75,null,"T",5.8496199999999998,17.078959999999999,18,8.9,6.35,15,null,null,16,406,405.6,null,null,null,null,null,null,null,null,null,null,11.5,9,11.42,null,11.5,"7½J, 8J, 8½J, 9J, 9½J, 10J",11.5,"8J, 8½J, 9J, 9½J, 10J, 10½J",11.5,"9J, 9½J, 10J, 10½J, 11J",11.5,"10J, 10½J, 11J, 11½J",11.5,"10½J, 11J, 11½J"]
[null,400,394,400,76,400,880,867.5,76,null,null,null,null,null,null,null,null,null,null,17,432,436.6,null,null,null,null,null,null,null,null,null,null,12.5,{"$f":"MROUND(AG11*0.8,0.5)","v":10},{"$f":"AG11+(0.4*(AH11-(AG11*0.8)))","v":12.5},null,12.5,"8J, 8½J, 9J, 9½J, 10J, 10½J",12.5,"8½J, 9J, 9½J, 10J, 10½J, 11J",12.5,"10J, 10½J, 11J, 11½J, 12J",12.5,"10½J, 11J, 11½J, 12J, 12½J",12.5,"11½J, 12J, 12½J"]
[null,412,406,412,77,412,910,895,77,null,null,null,null,null,null,null,null,null,null,18,457,462,null,null,null,null,null,null,null,null,null,null,13.5,11,13.58,null,13.5,"9J, 9½J, 10J, 10½J, 11J, 11½J",13.5,"9½J, 10J, 10½J, 11J, 11½J, 12J",13.5,"11J, 11½J, 12J, 12½J, 13J",13.5,"11½J, 12J, 12½J, 13J, 13½J",13.5,"12J, 12½J, 13J, 13½J"]
[null,425,419,425,78,425,935,922.5,78,null,"Profile Sizing Factors",null,null,null,null,null,null,null,null,19,483,487.4,null,null,null,null,null,null,null,null,null,null,14.5,11.5,14.459999999999999,null,14.5,"9½J, 10J, 10½J, 11J, 11½J, 12J, 12½J",14.5,"10J, 10½J, 11J, 11½J, 12J, 12½J, 13J",14.5,"11½J, 12J, 12½J, 13J, 13½J, 14J",14.5,"12½J, 13J, 13½J, 14J, 14½J",14.5,"13J, 13½J, 14J, 14½J"]
[null,437,431,437,79,437,965,950,79,null,null,null,null,"\"Custom\" Values",null,null,null,null,null,{"$f":"20","v":20},508,512.79999999999995,null,null,null,null,null,null,null,null,null,null,15.5,12.5,15.54,null,15.5,"10J, 10½J, 11J, 11½J, 12J, 12½J, 13J",15.5,"11J, 11½J, 12J, 12½J, 13J, 13½J, 14J",15.5,"12½J, 13J, 13½J, 14J, 14½J",15.5,"13J, 13½J, 14J, 14½J, 15J, 15½J",15.5,"14J, 14½J, 15J, 15½J"]
[null,450,444,450,80,450,990,{"$f":"AVERAGEA(G14:G15)","v":977.5},80,null,null,"Width %","SH %","Shldr Rad","Width","OD","RTW (X)","Trd Rad (Y)",null,{"$f":"21","v":21},533,538.20000000000005,null,null,null,null,null,null,null,null,null,null,16.5,13,16.419999999999998,null,16.5,"11J, 11½J. 12J, 12½J, 13J, 13½J, 14J",16.5,"11½J. 12J, 12½J, 13J, 13½J, 14J, 14½J, 15J",16.5,"13J, 13½J, 14J, 14½J, 15J, 15½J",16.5,"14J, 14½J, 15J, 15½J, 16J, 16½J",16.5,"15J, 15½J, 16J, 16½J"]
{"$rows_left_out":164}
{"sheet":"STATUS","index":8,"n_rows":123,"n_cols":31,"rows_kept":123,"cut":false,"hidden":true,"merged":[[3,29,3,30],[1,5,1,30],[1,1,1,3],[3,21,3,22],[3,23,3,24],[3,25,3,26],[3,27,3,28],[3,5,3,6],[3,7,3,8],[3,9,3,10],[3,11,3,12],[3,13,3,14],[3,15,3,16],[3,17,3,18],[3,19,3,20]]}
["YB DATE:",2026,"EDI DATE:","2025-10-29","Last row used:",{"$f":"MAX(IF(ISBLANK(A:A),0,ROW(A:A)))","v":123}]
["INPUT SIZE","STATUS",null,null,null,"EXCEPTIONS"]
[{"$f":"Do_nom&\"x\"&SN&\"0R\"&Rim_Code&\"LT\"","v":"33x11.50R22LT"},{"$f":"IF(ISNA(VLOOKUP(A3,A6:D2501,2,FALSE)),\"N/A\",VLOOKUP(A3,A6:D2501,2,FALSE))","v":"N/A"},{"$f":"IF(ISNA(VLOOKUP(A3,A6:D2501,3,FALSE)),\"Not Standardized\",VLOOKUP(A3,A6:D2501,3,FALSE))","v":"Not Standardized"},{"$f":"IF(ISNA(VLOOKUP(A3,A6:D2501,4,FALSE)),\"N/A\",IF(LEFT(VLOOKUP(A3,A6:D2501,4,FALSE),9)=\"YEAR BOOK\",B1&\" \"&VLOOKUP(A3,A6:D2501,4,FALSE),IF(VLOOKUP(A3,A6:D2501,4,FALSE)=\"EDI\",VLOOKUP(A3,A6:D2501,4,FALSE)&\" (\"&TEXT(D1,\"mm/dd/yy\")&\")\")))","v":"N/A"},null,{"$f":"IF(ISNA(VLOOKUP($A3,$A6:$AY2501,COLUMN(F2),FALSE)),\"\",VLOOKUP($A3,$A6:$AY2501,COLUMN(F2),FALSE))","v":""},"","","","","","","","","","","","","","","","","","","","","","","","",""]
[{"$f":"'DATA SHEET'!J6","v":"F"},{"$f":"IF(ISERROR(FIND(A4,B3)),\"no\", \"yes\")","v":"no"},"<-LR standard ? / line->",{"$f":"MATCH(A3,A6:A1000,0)+5","v":{"$error":"#N/A"}},"EXCEPTIONS /",170,null,210,null,250,null,280,null,310,null,350,null,380,null,410,null,450,null,480,null,520,null,550,null,650]
["TIRE SIZE","L R","STATUS","LOCATION","COMMENT","kg","lb","kg","lb","kg","lb","kg","lb","kg","lb","kg","lb","kg","lb","kg","lb","kg","lb","kg","lb","kg","lb","kg","lb","kg","lb"]
["27x8.50R14LT","B, C","TRA STANDARD","YEAR BOOK"]
["29x9.50R15LT","B, C","TRA STANDARD","YEAR BOOK"]
["30x9.50R14LT","B","TRA STANDARD","YEAR BOOK"]
["30x9.50R15LT","B, C","TRA STANDARD","YEAR BOOK"]
["31x10.50R15LT","B, C","TRA STANDARD","YEAR BOOK"]
["31x11.50R15LT","B, C","TRA STANDARD","YEAR BOOK"]
["31x12.50R15LT","C","TRA STANDARD","YEAR BOOK"]
["32x11.50R15LT","B, C","TRA STANDARD","YEAR BOOK"]
["32x9.50R15LT","B","TRA STANDARD","YEAR BOOK"]
["33x10.50R15LT","B, C","TRA STANDARD","YEAR BOOK"]
{"$rows_left_out":109}
{"sheet":"Export General Data","index":9,"n_rows":1,"n_cols":24,"rows_kept":1,"cut":false,"hidden":true,"merged":[]}
["SOURCE","ENTRY DATE","TYPE","TSD","CC","UM","SN","AR","DR","MRWIN","DSW","DODTD1","DODTD2","DODTD3","MOW","MOW1","MODTD1","MODTD2","MODTD3","MSF","MDS","MFW","TV","APPRIMS"]

{"sheet":"Export Loads Data","index":10,"n_rows":3,"n_cols":15,"rows_kept":3,"cut":false,"hidden":true,"merged":[]}
["SOURCE","ENTRY DATE","TYPE","TSD","CC","SPDRTG","UM","SD","IP","SN","AR","DR","LD","LI","LID"]
[1,2025,"LT","34x11.50R20LT","R","*","CU","S",95,11.5,null,20,3525,124,"F"]
[1,2025,"LT","34x11.50R20LT","R","*","SI","S",650,11.5,null,20,1600,124,"F"]